{"text_format":"3","workbook":"xlsx","n_sheets":6,"sheets":["Application statistics","Gender statistics","Multiple Apps","Data","Country codes","Vejledning"],"not_rendered":{"charts":2,"images":9,"defined_names":3,"pivot_tables":19},"read":"whole","date_system":"1900"}

{"sheet":"Application statistics","index":0,"n_rows":35,"n_cols":21,"rows_kept":35}
[]
[]
["Sum of Applications",null,null,"Sum of Applicants",null,null,"Sum of Applicants",{"$nulls":3},"Sum of Applicants",{"$nulls":3},"Sum of Applicants",{"$nulls":3},"Sum of Applications"]
["Country (home)","Total",null,"Country (home)","Total",null,"Origin  - Sub-region","Total",null,null,"Origin - Region","Total",null,null,"Origin","Total",null,null,"Programme","Total"]
[" ",1,null," ",1,{"$nulls":5},"#N/A",1,null,null,"Abroad",{"v":1,"d":"100%"},null,null," ",1]
["Grand Total",1,null,"Grand Total",1,{"$nulls":9},"Grand Total",{"v":1,"d":"100%"},null,null,"Grand Total",1]
[]
[]
[]
[{"$nulls":14},"Sum of Applications"]
[{"$nulls":14},"Recommendations","Total"]
[{"$nulls":14},3,1]
[{"$nulls":15},0]
[{"$nulls":14},"Grand Total",1]
[]
[]
[]
[]
[{"$nulls":14},"Sum of Applications"]
[{"$nulls":14},"Recommendations","Total"]
[{"$nulls":14},3,{"v":1,"d":"100%"}]
[{"$nulls":15},{"v":0,"d":"0%"}]
[{"$nulls":14},"Grand Total",{"v":1,"d":"100%"}]
{"$rows_empty":7}
[{"$nulls":18},"Sum of Applications"]
[{"$nulls":18},"Programme","AreaProj","Total"]
[{"$nulls":18}," "," ",1]
[{"$nulls":18},"  Total",null,1]
[{"$nulls":18},"Grand Total",null,1]

{"sheet":"Gender statistics","index":1,"n_rows":48,"n_cols":13,"rows_kept":48}
[]
[]
["Sum of Applications","Gender",{"$nulls":3},"Sum of Applications","Gender"]
["Programme"," ","Grand Total",null,null,"Edu level app"," ","Grand Total"]
[" ",1,1,null,null," ",1,1]
["Grand Total",1,1,null,null,"Grand Total",1,1]
[]
[]
[]
[]
[{"$nulls":5},"Sum of Applications","Gender"]
[{"$nulls":5},"Edu level app"," ","Grand Total"]
[{"$nulls":5}," ",{"v":1,"d":"100%"},{"v":1,"d":"100%"}]
[{"$nulls":5},"Grand Total",{"v":1,"d":"100%"},{"v":1,"d":"100%"}]
[]
[]
[]
[{"$nulls":10},"Average of Age","Gender"]
[{"$nulls":5},"Average of Age","Gender",{"$nulls":3},"Edu level app"," ","Grand Total"]
[{"$nulls":5},"Edu level app"," ","Grand Total",null,null," ",{"$error":"#VALUE!"},{"$error":"#VALUE!"}]
[{"$nulls":5}," ",{"$error":"#VALUE!"},{"$error":"#VALUE!"},null,null,"Grand Total",{"$error":"#VALUE!"},{"$error":"#VALUE!"}]
[{"$nulls":5},"Grand Total",{"$error":"#VALUE!"},{"$error":"#VALUE!"}]
[]
["Sum of Applications","Gender"]
["Company name"," ","Grand Total"]
[" ",{"v":1,"d":"100%"},{"v":1,"d":"100%"}]
["Grand Total",{"v":1,"d":"100%"},{"v":1,"d":"100%"},null,null,"Sum of Applications","Gender"]
[{"$nulls":5},"Origin - Region","(blank)"," ","Grand Total"]
[{"$nulls":6},0,null,0]
[{"$nulls":5},"#N/A",null,1,1]
[{"$nulls":5},"Grand Total",0,1,1]
[]
[]
[]
[]
[]
[]
[{"$nulls":5},"Sum of Applications","Gender"]
[{"$nulls":5},"Origin - Region","(blank)"," ","Grand Total"]
[{"$nulls":6},{"$error":"#DIV/0!"},{"$error":"#DIV/0!"},{"$error":"#DIV/0!"}]
{"$rows_left_out":9}
{"sheet":"Multiple Apps","index":2,"n_rows":55,"n_cols":8,"rows_kept":55}
["AppCount","(All)"]
[]
["Count of E-mail"]
["E-mail","First name","Last name","Candidate ID","Project title","Programme","Total","Mult. applications"]
[{"$nulls":7},{"$f":"F5&IF(AND(ISBLANK(A6),NOT(ISBLANK(G6))),\", \"&H6,\"\")","v":""}]
[{"$nulls":7},{"$f":"F6&IF(AND(ISBLANK(A7),NOT(ISBLANK(G7))),\", \"&H7,\"\")","v":""}]
[{"$nulls":7},""]
[{"$nulls":7},""]
[{"$nulls":7},""]
[{"$nulls":7},""]
[{"$nulls":7},""]
[{"$nulls":7},""]
[{"$nulls":7},""]
[{"$nulls":7},""]
[{"$nulls":7},""]
[{"$nulls":7},""]
[{"$nulls":7},""]
[{"$nulls":7},""]
[{"$nulls":7},""]
[{"$nulls":7},""]
[{"$nulls":7},""]
[{"$nulls":7},""]
[{"$nulls":7},""]
[{"$nulls":7},""]
[{"$nulls":7},""]
[{"$nulls":7},""]
[{"$nulls":7},""]
[{"$nulls":7},""]
[{"$nulls":7},""]
[{"$nulls":7},""]
[{"$nulls":7},""]
[{"$nulls":7},""]
[{"$nulls":7},""]
[{"$nulls":7},""]
[{"$nulls":7},""]
[{"$nulls":7},""]
[{"$nulls":7},""]
[{"$nulls":7},""]
[{"$nulls":7},""]
[{"$nulls":7},""]
{"$rows_left_out":16}
{"sheet":"Data","index":3,"n_rows":400,"n_cols":59,"rows_kept":400}
["AppCount","Mult. applications","Origin - Region","Origin  - Sub-region","Origin","Recommendations","Applications","Applicants","Age","Docs","Company name","Vacancy","Candidate ID","First name","Last name","Country (home)","E-mail","Country of citizenship","Gender","Date of birth","Edu name","Edu institution","Edu country","Edu level app","Edu status","Edu date","Edu grade point average app","Acad supplementary information","Previous PhD enrolment institution and country","Enrol start app","Enrol credit transfer (months) app","Enrol industrial PhD company app","Enrol hours/week and reason","Funding support app","AreaProj","Project title","Project abstract","Main supervisor app","Co-supervisor1 app","Co-sup1 pos app","Co-sup1 inst app","Co-sup1 em app","Ref1 name","Ref1 position","Ref1 institution","Ref1 email","R1s","Ref2 name","Ref2 position","Ref2 institution","Ref2 email","R2s","Ref3 name","Ref3 position","Ref3 institution","Ref3 email","R3s","Registration date","UpdateCode"]
[{"$f":"IF($G2,COUNTIF($Q:$Q,$Q2),0)","v":1},{"$f":"IF($G2,IFERROR(VLOOKUP(Q2,mult,8,FALSE),\"\"),\"\")","v":""},{"$f":"IF($G2,IFERROR(VLOOKUP($R2,CountryCodes[],4,FALSE),\"\"),\"\")","v":""},{"$f":"IF($G2,IFERROR(VLOOKUP($R2,CountryCodes[],5,FALSE),\"\"),\"\")","v":""},{"$f":"IF($G2,IF(R2=\"Denmark\",\"Denmark\",\"Abroad\"),\"\")","v":"Abroad"},{"$f":"IF($G2,IF(AU2=\"\",0,1)+IF(AZ2=\"\",0,1)+IF(BE2=\"\",0,1),\"\")","v":3},{"$f":"IF(M2=\"\",0,1)","v":1},{"$f":"IF($G2,1/$A2,0)","v":1},{"$f":"IF($G2,IF(ISBLANK(T2),\"?\",DAYS360(T2,NOW())/360),\"\")","v":{"$error":"#VALUE!"}},{"$f":"HYPERLINK(\"https://app.researchplanner.net/Peoplexs22/eFormportal/eForm.cfm?CandidateUpdateID=\"&M2&\"&CandidateUpdateCode=\"&BG2&\"&Locale=en&CustomFormID=11612\",\"Docs\")","v":"Docs"}," "," "," "," "," "," "," "," "," "," "," "," "," "," "," "," "," "," "," "," "," "," "," "," "," "," "," "," "," "," "," "," "," "," "," "," "," "," "," "," "," "," "," "," "," "," "," "," "," "]
[0,{"$f":"IF($G3,IFERROR(VLOOKUP(Q3,mult,8,FALSE),\"\"),\"\")","v":""},{"$f":"IF($G3,VLOOKUP($R3,'Country codes'!$A$1:$E$247,4,FALSE),\"\")","v":""},{"$f":"IF($G3,VLOOKUP($R3,'Country codes'!$A$1:$E$247,5,FALSE),\"\")","v":""},{"$f":"IF($G3,IF(R3=\"Denmark\",\"Denmark\",\"Abroad\"),\"\")","v":""},{"$f":"IF($G3,IF(AU3=\"\",0,1)+IF(AZ3=\"\",0,1)+IF(BE3=\"\",0,1),\"\")","v":""},{"$f":"IF(M3=\"\",0,1)","v":0},{"$f":"IF($G3,1/$A3,0)","v":0},{"$f":"IF($G3,IF(ISBLANK(T3),\"?\",DAYS360(T3,NOW())/360),\"\")","v":""},{"$f":"HYPERLINK(\"https://app.researchplanner.net/Peoplexs22/eFormportal/eForm.cfm?CandidateUpdateID=\"&M3&\"&CandidateUpdateCode=\"&BG3&\"&Locale=en&CustomFormID=11612\",\"Docs\")","v":"Docs"}]
[0,"",{"$f":"IF($G4,VLOOKUP($R4,'Country codes'!$A$1:$E$247,4,FALSE),\"\")","v":""},{"$f":"IF($G4,VLOOKUP($R4,'Country codes'!$A$1:$E$247,5,FALSE),\"\")","v":""},"","",0,0,"","Docs"]
[0,"",{"$f":"IF($G5,VLOOKUP($R5,'Country codes'!$A$1:$E$247,4,FALSE),\"\")","v":""},{"$f":"IF($G5,VLOOKUP($R5,'Country codes'!$A$1:$E$247,5,FALSE),\"\")","v":""},"","",0,0,"","Docs"]
[0,"",{"$f":"IF($G6,VLOOKUP($R6,'Country codes'!$A$1:$E$247,4,FALSE),\"\")","v":""},{"$f":"IF($G6,VLOOKUP($R6,'Country codes'!$A$1:$E$247,5,FALSE),\"\")","v":""},"","",0,0,"","Docs"]
[0,"",{"$f":"IF($G7,VLOOKUP($R7,'Country codes'!$A$1:$E$247,4,FALSE),\"\")","v":""},{"$f":"IF($G7,VLOOKUP($R7,'Country codes'!$A$1:$E$247,5,FALSE),\"\")","v":""},"","",0,0,"","Docs"]
[0,"",{"$f":"IF($G8,VLOOKUP($R8,'Country codes'!$A$1:$E$247,4,FALSE),\"\")","v":""},{"$f":"IF($G8,VLOOKUP($R8,'Country codes'!$A$1:$E$247,5,FALSE),\"\")","v":""},"","",0,0,"","Docs"]
[0,"",{"$f":"IF($G9,VLOOKUP($R9,'Country codes'!$A$1:$E$247,4,FALSE),\"\")","v":""},{"$f":"IF($G9,VLOOKUP($R9,'Country codes'!$A$1:$E$247,5,FALSE),\"\")","v":""},"","",0,0,"","Docs"]
[0,"",{"$f":"IF($G10,VLOOKUP($R10,'Country codes'!$A$1:$E$247,4,FALSE),\"\")","v":""},{"$f":"IF($G10,VLOOKUP($R10,'Country codes'!$A$1:$E$247,5,FALSE),\"\")","v":""},"","",0,0,"","Docs"]
[0,"",{"$f":"IF($G11,VLOOKUP($R11,'Country codes'!$A$1:$E$247,4,FALSE),\"\")","v":""},{"$f":"IF($G11,VLOOKUP($R11,'Country codes'!$A$1:$E$247,5,FALSE),\"\")","v":""},"","",0,0,"","Docs"]
[0,"",{"$f":"IF($G12,VLOOKUP($R12,'Country codes'!$A$1:$E$247,4,FALSE),\"\")","v":""},{"$f":"IF($G12,VLOOKUP($R12,'Country codes'!$A$1:$E$247,5,FALSE),\"\")","v":""},"","",0,0,"","Docs"]
[0,"",{"$f":"IF($G13,VLOOKUP($R13,'Country codes'!$A$1:$E$247,4,FALSE),\"\")","v":""},{"$f":"IF($G13,VLOOKUP($R13,'Country codes'!$A$1:$E$247,5,FALSE),\"\")","v":""},"","",0,0,"","Docs"]
[0,"",{"$f":"IF($G14,VLOOKUP($R14,'Country codes'!$A$1:$E$247,4,FALSE),\"\")","v":""},{"$f":"IF($G14,VLOOKUP($R14,'Country codes'!$A$1:$E$247,5,FALSE),\"\")","v":""},"","",0,0,"","Docs"]
[0,"",{"$f":"IF($G15,VLOOKUP($R15,'Country codes'!$A$1:$E$247,4,FALSE),\"\")","v":""},{"$f":"IF($G15,VLOOKUP($R15,'Country codes'!$A$1:$E$247,5,FALSE),\"\")","v":""},"","",0,0,"","Docs"]
[0,"",{"$f":"IF($G16,VLOOKUP($R16,'Country codes'!$A$1:$E$247,4,FALSE),\"\")","v":""},{"$f":"IF($G16,VLOOKUP($R16,'Country codes'!$A$1:$E$247,5,FALSE),\"\")","v":""},"","",0,0,"","Docs"]
[0,"",{"$f":"IF($G17,VLOOKUP($R17,'Country codes'!$A$1:$E$247,4,FALSE),\"\")","v":""},{"$f":"IF($G17,VLOOKUP($R17,'Country codes'!$A$1:$E$247,5,FALSE),\"\")","v":""},"","",0,0,"","Docs"]
[0,"",{"$f":"IF($G18,VLOOKUP($R18,'Country codes'!$A$1:$E$247,4,FALSE),\"\")","v":""},{"$f":"IF($G18,VLOOKUP($R18,'Country codes'!$A$1:$E$247,5,FALSE),\"\")","v":""},"","",0,0,"","Docs"]
[0,"",{"$f":"IF($G19,VLOOKUP($R19,'Country codes'!$A$1:$E$247,4,FALSE),\"\")","v":""},{"$f":"IF($G19,VLOOKUP($R19,'Country codes'!$A$1:$E$247,5,FALSE),\"\")","v":""},"","",0,0,"","Docs"]
[0,"",{"$f":"IF($G20,VLOOKUP($R20,'Country codes'!$A$1:$E$247,4,FALSE),\"\")","v":""},{"$f":"IF($G20,VLOOKUP($R20,'Country codes'!$A$1:$E$247,5,FALSE),\"\")","v":""},"","",0,0,"","Docs"]
[0,"",{"$f":"IF($G21,VLOOKUP($R21,'Country codes'!$A$1:$E$247,4,FALSE),\"\")","v":""},{"$f":"IF($G21,VLOOKUP($R21,'Country codes'!$A$1:$E$247,5,FALSE),\"\")","v":""},"","",0,0,"","Docs"]
[0,"",{"$f":"IF($G22,VLOOKUP($R22,'Country codes'!$A$1:$E$247,4,FALSE),\"\")","v":""},{"$f":"IF($G22,VLOOKUP($R22,'Country codes'!$A$1:$E$247,5,FALSE),\"\")","v":""},"","",0,0,"","Docs"]
[0,"",{"$f":"IF($G23,VLOOKUP($R23,'Country codes'!$A$1:$E$247,4,FALSE),\"\")","v":""},{"$f":"IF($G23,VLOOKUP($R23,'Country codes'!$A$1:$E$247,5,FALSE),\"\")","v":""},"","",0,0,"","Docs"]
[0,"",{"$f":"IF($G24,VLOOKUP($R24,'Country codes'!$A$1:$E$247,4,FALSE),\"\")","v":""},{"$f":"IF($G24,VLOOKUP($R24,'Country codes'!$A$1:$E$247,5,FALSE),\"\")","v":""},"","",0,0,"","Docs"]
[0,"",{"$f":"IF($G25,VLOOKUP($R25,'Country codes'!$A$1:$E$247,4,FALSE),\"\")","v":""},{"$f":"IF($G25,VLOOKUP($R25,'Country codes'!$A$1:$E$247,5,FALSE),\"\")","v":""},"","",0,0,"","Docs"]
[0,"",{"$f":"IF($G26,VLOOKUP($R26,'Country codes'!$A$1:$E$247,4,FALSE),\"\")","v":""},{"$f":"IF($G26,VLOOKUP($R26,'Country codes'!$A$1:$E$247,5,FALSE),\"\")","v":""},"","",0,0,"","Docs"]
[0,"",{"$f":"IF($G27,VLOOKUP($R27,'Country codes'!$A$1:$E$247,4,FALSE),\"\")","v":""},{"$f":"IF($G27,VLOOKUP($R27,'Country codes'!$A$1:$E$247,5,FALSE),\"\")","v":""},"","",0,0,"","Docs"]
[0,"",{"$f":"IF($G28,VLOOKUP($R28,'Country codes'!$A$1:$E$247,4,FALSE),\"\")","v":""},{"$f":"IF($G28,VLOOKUP($R28,'Country codes'!$A$1:$E$247,5,FALSE),\"\")","v":""},"","",0,0,"","Docs"]
[0,"",{"$f":"IF($G29,VLOOKUP($R29,'Country codes'!$A$1:$E$247,4,FALSE),\"\")","v":""},{"$f":"IF($G29,VLOOKUP($R29,'Country codes'!$A$1:$E$247,5,FALSE),\"\")","v":""},"","",0,0,"","Docs"]
[0,"",{"$f":"IF($G30,VLOOKUP($R30,'Country codes'!$A$1:$E$247,4,FALSE),\"\")","v":""},{"$f":"IF($G30,VLOOKUP($R30,'Country codes'!$A$1:$E$247,5,FALSE),\"\")","v":""},"","",0,0,"","Docs"]
[0,"",{"$f":"IF($G31,VLOOKUP($R31,'Country codes'!$A$1:$E$247,4,FALSE),\"\")","v":""},{"$f":"IF($G31,VLOOKUP($R31,'Country codes'!$A$1:$E$247,5,FALSE),\"\")","v":""},"","",0,0,"","Docs"]
[0,"",{"$f":"IF($G32,VLOOKUP($R32,'Country codes'!$A$1:$E$247,4,FALSE),\"\")","v":""},{"$f":"IF($G32,VLOOKUP($R32,'Country codes'!$A$1:$E$247,5,FALSE),\"\")","v":""},"","",0,0,"","Docs"]
[0,"",{"$f":"IF($G33,VLOOKUP($R33,'Country codes'!$A$1:$E$247,4,FALSE),\"\")","v":""},{"$f":"IF($G33,VLOOKUP($R33,'Country codes'!$A$1:$E$247,5,FALSE),\"\")","v":""},"","",0,0,"","Docs"]
[0,"",{"$f":"IF($G34,VLOOKUP($R34,'Country codes'!$A$1:$E$247,4,FALSE),\"\")","v":""},{"$f":"IF($G34,VLOOKUP($R34,'Country codes'!$A$1:$E$247,5,FALSE),\"\")","v":""},"","",0,0,"","Docs"]
[0,"",{"$f":"IF($G35,VLOOKUP($R35,'Country codes'!$A$1:$E$247,4,FALSE),\"\")","v":""},{"$f":"IF($G35,VLOOKUP($R35,'Country codes'!$A$1:$E$247,5,FALSE),\"\")","v":""},"","",0,0,"","Docs"]
[0,"",{"$f":"IF($G36,VLOOKUP($R36,'Country codes'!$A$1:$E$247,4,FALSE),\"\")","v":""},{"$f":"IF($G36,VLOOKUP($R36,'Country codes'!$A$1:$E$247,5,FALSE),\"\")","v":""},"","",0,0,"","Docs"]
[0,"",{"$f":"IF($G37,VLOOKUP($R37,'Country codes'!$A$1:$E$247,4,FALSE),\"\")","v":""},{"$f":"IF($G37,VLOOKUP($R37,'Country codes'!$A$1:$E$247,5,FALSE),\"\")","v":""},"","",0,0,"","Docs"]
[0,"",{"$f":"IF($G38,VLOOKUP($R38,'Country codes'!$A$1:$E$247,4,FALSE),\"\")","v":""},{"$f":"IF($G38,VLOOKUP($R38,'Country codes'!$A$1:$E$247,5,FALSE),\"\")","v":""},"","",0,0,"","Docs"]
[0,"",{"$f":"IF($G39,VLOOKUP($R39,'Country codes'!$A$1:$E$247,4,FALSE),\"\")","v":""},{"$f":"IF($G39,VLOOKUP($R39,'Country codes'!$A$1:$E$247,5,FALSE),\"\")","v":""},"","",0,0,"","Docs"]
[0,"",{"$f":"IF($G40,VLOOKUP($R40,'Country codes'!$A$1:$E$247,4,FALSE),\"\")","v":""},{"$f":"IF($G40,VLOOKUP($R40,'Country codes'!$A$1:$E$247,5,FALSE),\"\")","v":""},"","",0,0,"","Docs"]
{"$rows_left_out":361}
{"sheet":"Country codes","index":4,"n_rows":254,"n_cols":5,"rows_kept":254}
["Country (ARH3)","ISO2","Land","Region","Sub-region"]
["Aaland islands","ax","Ålandsøerne","Europe","Northern Europe"]
["Afghanistan","af","Afghanistan","Asia","South-central Asia"]
["Albania","al","Albanien","Europe","Southern Europe"]
["Algeria","dz","Algeriet","Africa","Northern Africa"]
["American Samoa","as","Samoa, Amerikansk Samoa","Oceania","Polynesia"]
["Andorra","ad","Andorra","Europe","Southern Europe"]
["Angola","ao","Angola","Africa","Middle Africa"]
["Anguilla","ai","Anguilla","Latin America and the Caribbean","Caribbean"]
["Antarctica","aq","Antarktis","Antarctic","Antarctic"]
["Antigua and Barbuda","ag","Antigua og Barbuda","Latin America and the Caribbean","Caribbean"]
["Argentina","ar","Argentina","Latin America and the Caribbean","South America"]
["Armenia","am","Armenien","Asia","Western Asia"]
["Aruba","aw","Aruba","Latin America and the Caribbean","Caribbean"]
["Australia","au","Australien","Oceania","Australia and New Zealand"]
["Austria","at","Østrig","Europe","Western Europe"]
["Azerbaijan","az","Aserbajdsjan, Azerbajdjan","Asia","Western Asia"]
["Bahamas","bs","Bahamas","Latin America and the Caribbean","Caribbean"]
["Bahrain","bh","Bahrain","Asia","Western Asia"]
["Bangladesh","bd","Bangladesh","Asia","South-central Asia"]
["Barbados","bb","Barbados","Latin America and the Caribbean","Caribbean"]
["Belarus","by","Belarus (Hviderusland)","Europe","Eastern Europe"]
["Belgium","be","Belgien","Europe","Western Europe"]
["Belize","bz","Belize","Latin America and the Caribbean","Central America"]
["Benin","bj","Benin","Africa","Western Africa"]
["Bermuda","bm","Bermuda","Northern America","Northern America"]
["Bhutan","bt","Bhutan","Asia","South-central Asia"]
["Bolivia","bo","Bolivia","Latin America and the Caribbean","South America"]
["Bonaire, Sint Eustatius and Saba","bq","Bonaire, Sint Eustatius og Saba","Latin America and the Caribbean","Caribbean"]
["Bosnia and Herzegovina","ba","Bosnien-Herzegovina","Europe","Southern Europe"]
["Botswana","bw","Botswana","Africa","Southern Africa"]
["Bouvet Island","bv","Bouvet øen","Antarctic","Antarctic"]
["Brazil","br","Brasilien","Latin America and the Caribbean","South America"]
["British Virgin Islands","io","Jomfruøerne","Africa","Eastern Africa"]
["Brunei","bn","Brunei","Asia","South-eastern Asia"]
["Bulgaria","bg","Bulgarien","Europe","Eastern Europe"]
["Burkina Faso","bf","Burkina Faso","Africa","Western Africa"]
["Burundi","bi","Burundi","Africa","Eastern Africa"]
["Cambodia","kh","Cambodja","Asia","South-eastern Asia"]
["Cameroon","cm","Cameroun","Africa","Middle Africa"]
{"$rows_left_out":215}
{"sheet":"Vejledning","index":5,"n_rows":80,"n_cols":5,"rows_kept":80,"merged":[[1,0,1,1],[1,3,1,4]]}
[]
["Genering af rapport i PhD Planneren samt efterfølgende behandling af data i excel ",null,null,"Kopi af Data-fanebladet til udsplitning og upload på de enkelte programopslag"]
[]
["1.","I PhD Planneren:",null,"10.","I det samlede regneark:"]
[null,"a: Tjek at alle programopslag har status \"Awaits prog. assessment\"",null,null,"a: Højreklik på fanebladet \"Data\" og vælg \"Move or Copy...\""]
[null,"b: Vælg \"Kampagnestyring\" » \"Rapporter og diagrammer\"",null,null,"b: Vælg To book: \"(new book)\""]
[null,"c: Kør rapporten \"Application Data\" i mappen PHD",null,null,"c: Sæt kryds i \"Create a copy\""]
[null,"d: Åbn regnearket",null,null,"d: Tryk \"OK\""]
[]
["2.","Åbn \"Template for Application Data\" ",null,"11.","Gem det nye regneark"]
[]
["3.","I regnearket fra PhD Planneren:",null,"12.","I det nye regneark:"]
[null,"a: Højreklik på fanebladet og vælg \"Move or Copy...\"",null,null,"a: Udpeg hele søjle I: Age"]
[null,"b: Vælg To book: \"Template for Application Data\"",null,null,"b: Kopier den - tryk <ctrl> + c"]
[null,"c: Vælg Before sheet: \"Country Codes\"",null,null,"c: Højreklik og vælg \"Paste Speciel…\" » \"Values (V)\""]
[null,"d: Tryk \"OK\"",null,null,"    ELLER"]
[{"$nulls":4},"    Klik på \"Paste\"-knappen på Home-fanen øverst og vælg \"Values (V)\" "]
[null,"Fanebladet i regnearket fra PhD Planneren flyttes nu ind i \"Template for Application Data\", og der arbejdes videre i \"Template for Application Data\":",null,null,"    (Ligesom i punkt 6)\nd: Tryk \"OK\""]
[]
["4.","På fanebladet \"Report-X\" vælges alle celler fra og med cellerne i den første blå række til, men ikke med cellerne i den sidste blå række. \nBrug musen eller til at udpege området. Eller brug tastaturet således:",null,"13.","Slet søjle A-H. Dvs. til, men ikke med Age-kolonnen.\nAge er nu blevet til søjle A"]
[null,"a: Udpeg den blå celle \"Company name\" (A5)",null,"14.","Hvis ikke der allerede er filtre på kolonnerne, gør således for at aktivere filtrene:"]
[null,"b: Hold <ctrl>+<Skift> nede og tryk på højre pil",null,null,"Marker celle A1 (Age-cellen):"]
[null,"c: Behold <ctrl>+<Skift> nede og tryk på pil ned",null,null,"a: Klik på celle A1 for at markere den"]
[null,"d: Behold <skift> nede, slip <ctrl> og tryk pil op",null,null,"b: Klik på Data-fanen foroven og klik på \"Filter\"-knappen"]
[]
["5.","Kopier det markerede område - tryk <ctrl> + c"]
[]
["6.","Dataene fra fanebladet \"Report-X\" skal nu indsættes på fanebladet \"Data\":"]
[null,"a: Klik på fanebladet \"Data\" på den grønne celle \"Company name\""]
[null,"b: Højreklik og vælg \"Paste Speciel…\" » \"Values (V)\""]
[null,"    ELLER"]
[null,"    Klik på \"Paste\"-knappen på Home-fanen øverst og vælg \"Values (V)\"",null,null,"Der kommer nu pile ved siden af overskrifterne i række 1. Pilene indikerer at man kan  "]
[{"$nulls":4},"sortere værdierne i kolonnerne."]
[]
[]
[{"$nulls":3},"15.","Hvis ikke den øverst række allerede er fastlås, gør således for at fastlåse den:"]
[{"$nulls":4},"a: Klik på View-fanen øverst, klik på \"Freeze Panes\" » \"Freeze Top Row\" "]
{"$rows_empty":13}
[{"$nulls":4},"Den øverste række kan nu ses, ligegyldigt hvor langt der scrolles ned."]
[]
{"$rows_left_out":21}