{"text_format":"3","workbook":"xlsx","n_sheets":5,"sheets":["Application statistics","Gender statistics","Data","Country codes","Vejledning"],"not_rendered":{"charts":2,"images":6,"defined_names":3,"pivot_tables":17},"read":"whole","date_system":"1900"}

{"sheet":"Application statistics","index":0,"n_rows":22,"n_cols":20,"rows_kept":22}
[]
[]
["Sum of Applications",null,null,"Sum of Applicants",null,null,"Sum of Applicants",{"$nulls":3},"Sum of Applicants",{"$nulls":3},"Sum of Applicants","Total",null,null,"Sum of Applications"]
["Country (home)","Total",null,"Country (home)","Total",null,"Origin - sub-region","Total",null,null,"Origin - region","Total",null,null,"Total",{"v":1,"d":"100%"},null,null,"Programme","Total"]
[" ",1,null," ",1,null,"#N/A",1,null,null,"#N/A",1,{"$nulls":6}," ",1]
["Grand Total",1,null,"Grand Total",1,{"$nulls":13},"Grand Total",1]
[]
[]
[]
[{"$nulls":14},"Sum of Applications"]
[{"$nulls":14},"Recommendations","Total"]
[{"$nulls":14},3,1]
[{"$nulls":14},"Grand Total",1]
[]
[]
[]
[]
[]
[{"$nulls":14},"Sum of Applications"]
[{"$nulls":14},"Recommendations","Total"]
[{"$nulls":14},3,{"v":1,"d":"100%"}]
[{"$nulls":14},"Grand Total",{"v":1,"d":"100%"}]

{"sheet":"Gender statistics","index":1,"n_rows":48,"n_cols":13,"rows_kept":48}
[]
[]
["Sum of Applications","Gender",{"$nulls":3},"Sum of Applications","Gender"]
["Programme"," ","Grand Total",null,null,"Edu level prg"," ","Grand Total"]
[" ",1,1,null,null," ",1,1]
["Grand Total",1,1,null,null,"Grand Total",1,1]
[]
[]
[]
[]
[{"$nulls":5},"Sum of Applications","Gender"]
[{"$nulls":5},"Edu level prg"," ","Grand Total"]
[{"$nulls":5}," ",{"v":1,"d":"100%"},{"v":1,"d":"100%"}]
[{"$nulls":5},"Grand Total",{"v":1,"d":"100%"},{"v":1,"d":"100%"}]
[]
[]
[]
[{"$nulls":10},"Average of Age","Gender"]
[{"$nulls":5},"Average of Age","Gender",{"$nulls":3},"Edu level prg"," ","Grand Total"]
[{"$nulls":5},"Edu level prg"," ","Grand Total",null,null," ",{"$error":"#VALUE!"},{"$error":"#VALUE!"}]
[{"$nulls":5}," ",{"$error":"#VALUE!"},{"$error":"#VALUE!"},null,null,"Grand Total",{"$error":"#VALUE!"},{"$error":"#VALUE!"}]
[{"$nulls":5},"Grand Total",{"$error":"#VALUE!"},{"$error":"#VALUE!"}]
[]
["Sum of Applications","Gender"]
["Company name"," ","Grand Total"]
[" ",{"v":1,"d":"100%"},{"v":1,"d":"100%"}]
["Grand Total",{"v":1,"d":"100%"},{"v":1,"d":"100%"},null,null,"Sum of Applications","Gender"]
[{"$nulls":6}," ","Grand Total"]
[{"$nulls":5},"Total",1,1]
{"$rows_empty":8}
[{"$nulls":5},"Sum of Applications","Gender"]
[{"$nulls":6}," ","Grand Total"]
[{"$nulls":5},"Total",{"v":1,"d":"100%"},{"v":1,"d":"100%"}]
[]
[]
[]
[]
["Average of Age","Gender"]
["Programme"," ","Grand Total"]
[" ",{"$error":"#VALUE!"},{"$error":"#VALUE!"}]
["Grand Total",{"$error":"#VALUE!"},{"$error":"#VALUE!"}]

{"sheet":"Data","index":2,"n_rows":398,"n_cols":60,"rows_kept":398}
["AppCount","Origin - region","Origin - sub-region","Origin","Recommendations","Applications","Applicants","Age","Docs","Company name","Vacancy","Candidate ID","First name","Last name","Country (home)","E-mail","Country of citizenship","Gender","Date of birth","Edu name","Edu institution","Edu country","Edu status","Edu date","Acad supplementary information","Previous PhD enrolment institution and country","Enrol industrial PhD company app","Enrol hours/week and reason","AreaProj","Project title","Ref1 name","Ref1 position","Ref1 institution","Ref1 email","R1s","Ref2 name","Ref2 position","Ref2 institution","Ref2 email","R2s","Ref3 name","Ref3 position","Ref3 institution","Ref3 email","R3s","Academic background","Acad.Assessment (=AA for Managers)","Edu level prg","Edu grade point average prg","Enrol start prg","Enrol credit transfer (months) prg","Funding suggestion prg","Main supervisor prg","Co-supervisor1 name prg","Co-supervisor1 position prg","Co-supervisor1 institution prg","Co-supervisor1 email prg","Last workflow location","Last workflow status","UpdateCode"]
[{"$f":"IF($F2,COUNTIF($P:$P,$P2),0)","v":1},{"$f":"IF($F2,IFERROR(VLOOKUP($Q2,CountryCodes[],4,FALSE),\"\"),\"\")","v":""},{"$f":"IF($F2,IFERROR(VLOOKUP($Q2,CountryCodes[],5,FALSE),\"\"),\"\")","v":""},{"$f":"IF($F2,IF(Q2=\"Denmark\",\"Denmark\",\"Abroad\"),\"\")","v":"Abroad"},{"$f":"IF($F2,IF(AI2=\"\",0,1)+IF(AN2=\"\",0,1)+IF(AS2=\"\",0,1),\"\")","v":3},{"$f":"IF(L2=\"\",0,1)","v":1},{"$f":"IF($F2,1/$A2,0)","v":1},{"$f":"IF($F2,IF(ISBLANK(S2),\"?\",DAYS360(S2,NOW())/360),\"\")","v":{"$error":"#VALUE!"}},{"$f":"HYPERLINK(\"https://app.researchplanner.net/Peoplexs22/eFormportal/eForm.cfm?CandidateUpdateID=\"&L2&\"&CandidateUpdateCode=\"&BH2&\"&Locale=en&CustomFormID=11612\",\"Docs\")","v":"Docs"}," "," "," "," "," "," "," "," "," "," "," "," "," "," "," "," "," "," "," "," "," "," "," "," "," "," "," "," "," "," "," "," "," "," "," "," "," "," "," "," "," "," "," "," "," "," "," "," "," "," "]
[0,{"$f":"IF($F3,VLOOKUP($Q3,'Country codes'!$A$1:$E$247,4,FALSE),\"\")","v":""},{"$f":"IF($F3,VLOOKUP($Q3,'Country codes'!$A$1:$E$247,5,FALSE),\"\")","v":""},"","",0,0,"",{"$f":"HYPERLINK(\"https://app.researchplanner.net/Peoplexs22/eFormportal/eForm.cfm?CandidateUpdateID=\"&L3&\"&CandidateUpdateCode=\"&BH3&\"&Locale=en&CustomFormID=11612\",\"Docs\")","v":"Docs"}]
[0,{"$f":"IF($F4,VLOOKUP($Q4,'Country codes'!$A$1:$E$247,4,FALSE),\"\")","v":""},{"$f":"IF($F4,VLOOKUP($Q4,'Country codes'!$A$1:$E$247,5,FALSE),\"\")","v":""},"","",0,0,"","Docs"]
[0,{"$f":"IF($F5,VLOOKUP($Q5,'Country codes'!$A$1:$E$247,4,FALSE),\"\")","v":""},{"$f":"IF($F5,VLOOKUP($Q5,'Country codes'!$A$1:$E$247,5,FALSE),\"\")","v":""},"","",0,0,"","Docs"]
[0,{"$f":"IF($F6,VLOOKUP($Q6,'Country codes'!$A$1:$E$247,4,FALSE),\"\")","v":""},{"$f":"IF($F6,VLOOKUP($Q6,'Country codes'!$A$1:$E$247,5,FALSE),\"\")","v":""},"","",0,0,"","Docs"]
[0,{"$f":"IF($F7,VLOOKUP($Q7,'Country codes'!$A$1:$E$247,4,FALSE),\"\")","v":""},{"$f":"IF($F7,VLOOKUP($Q7,'Country codes'!$A$1:$E$247,5,FALSE),\"\")","v":""},"","",0,0,"","Docs"]
[0,{"$f":"IF($F8,VLOOKUP($Q8,'Country codes'!$A$1:$E$247,4,FALSE),\"\")","v":""},{"$f":"IF($F8,VLOOKUP($Q8,'Country codes'!$A$1:$E$247,5,FALSE),\"\")","v":""},"","",0,0,"","Docs"]
[0,{"$f":"IF($F9,VLOOKUP($Q9,'Country codes'!$A$1:$E$247,4,FALSE),\"\")","v":""},{"$f":"IF($F9,VLOOKUP($Q9,'Country codes'!$A$1:$E$247,5,FALSE),\"\")","v":""},"","",0,0,"","Docs"]
[0,{"$f":"IF($F10,VLOOKUP($Q10,'Country codes'!$A$1:$E$247,4,FALSE),\"\")","v":""},{"$f":"IF($F10,VLOOKUP($Q10,'Country codes'!$A$1:$E$247,5,FALSE),\"\")","v":""},"","",0,0,"","Docs"]
[0,{"$f":"IF($F11,VLOOKUP($Q11,'Country codes'!$A$1:$E$247,4,FALSE),\"\")","v":""},{"$f":"IF($F11,VLOOKUP($Q11,'Country codes'!$A$1:$E$247,5,FALSE),\"\")","v":""},"","",0,0,"","Docs"]
[0,{"$f":"IF($F12,VLOOKUP($Q12,'Country codes'!$A$1:$E$247,4,FALSE),\"\")","v":""},{"$f":"IF($F12,VLOOKUP($Q12,'Country codes'!$A$1:$E$247,5,FALSE),\"\")","v":""},"","",0,0,"","Docs"]
[0,{"$f":"IF($F13,VLOOKUP($Q13,'Country codes'!$A$1:$E$247,4,FALSE),\"\")","v":""},{"$f":"IF($F13,VLOOKUP($Q13,'Country codes'!$A$1:$E$247,5,FALSE),\"\")","v":""},"","",0,0,"","Docs"]
[0,{"$f":"IF($F14,VLOOKUP($Q14,'Country codes'!$A$1:$E$247,4,FALSE),\"\")","v":""},{"$f":"IF($F14,VLOOKUP($Q14,'Country codes'!$A$1:$E$247,5,FALSE),\"\")","v":""},"","",0,0,"","Docs"]
[0,{"$f":"IF($F15,VLOOKUP($Q15,'Country codes'!$A$1:$E$247,4,FALSE),\"\")","v":""},{"$f":"IF($F15,VLOOKUP($Q15,'Country codes'!$A$1:$E$247,5,FALSE),\"\")","v":""},"","",0,0,"","Docs"]
[0,{"$f":"IF($F16,VLOOKUP($Q16,'Country codes'!$A$1:$E$247,4,FALSE),\"\")","v":""},{"$f":"IF($F16,VLOOKUP($Q16,'Country codes'!$A$1:$E$247,5,FALSE),\"\")","v":""},"","",0,0,"","Docs"]
[0,{"$f":"IF($F17,VLOOKUP($Q17,'Country codes'!$A$1:$E$247,4,FALSE),\"\")","v":""},{"$f":"IF($F17,VLOOKUP($Q17,'Country codes'!$A$1:$E$247,5,FALSE),\"\")","v":""},"","",0,0,"","Docs"]
[0,{"$f":"IF($F18,VLOOKUP($Q18,'Country codes'!$A$1:$E$247,4,FALSE),\"\")","v":""},{"$f":"IF($F18,VLOOKUP($Q18,'Country codes'!$A$1:$E$247,5,FALSE),\"\")","v":""},"","",0,0,"","Docs"]
[0,{"$f":"IF($F19,VLOOKUP($Q19,'Country codes'!$A$1:$E$247,4,FALSE),\"\")","v":""},{"$f":"IF($F19,VLOOKUP($Q19,'Country codes'!$A$1:$E$247,5,FALSE),\"\")","v":""},"","",0,0,"","Docs"]
[0,{"$f":"IF($F20,VLOOKUP($Q20,'Country codes'!$A$1:$E$247,4,FALSE),\"\")","v":""},{"$f":"IF($F20,VLOOKUP($Q20,'Country codes'!$A$1:$E$247,5,FALSE),\"\")","v":""},"","",0,0,"","Docs"]
[0,{"$f":"IF($F21,VLOOKUP($Q21,'Country codes'!$A$1:$E$247,4,FALSE),\"\")","v":""},{"$f":"IF($F21,VLOOKUP($Q21,'Country codes'!$A$1:$E$247,5,FALSE),\"\")","v":""},"","",0,0,"","Docs"]
[0,{"$f":"IF($F22,VLOOKUP($Q22,'Country codes'!$A$1:$E$247,4,FALSE),\"\")","v":""},{"$f":"IF($F22,VLOOKUP($Q22,'Country codes'!$A$1:$E$247,5,FALSE),\"\")","v":""},"","",0,0,"","Docs"]
[0,{"$f":"IF($F23,VLOOKUP($Q23,'Country codes'!$A$1:$E$247,4,FALSE),\"\")","v":""},{"$f":"IF($F23,VLOOKUP($Q23,'Country codes'!$A$1:$E$247,5,FALSE),\"\")","v":""},"","",0,0,"","Docs"]
[0,{"$f":"IF($F24,VLOOKUP($Q24,'Country codes'!$A$1:$E$247,4,FALSE),\"\")","v":""},{"$f":"IF($F24,VLOOKUP($Q24,'Country codes'!$A$1:$E$247,5,FALSE),\"\")","v":""},"","",0,0,"","Docs"]
[0,{"$f":"IF($F25,VLOOKUP($Q25,'Country codes'!$A$1:$E$247,4,FALSE),\"\")","v":""},{"$f":"IF($F25,VLOOKUP($Q25,'Country codes'!$A$1:$E$247,5,FALSE),\"\")","v":""},"","",0,0,"","Docs"]
[0,{"$f":"IF($F26,VLOOKUP($Q26,'Country codes'!$A$1:$E$247,4,FALSE),\"\")","v":""},{"$f":"IF($F26,VLOOKUP($Q26,'Country codes'!$A$1:$E$247,5,FALSE),\"\")","v":""},"","",0,0,"","Docs"]
[0,{"$f":"IF($F27,VLOOKUP($Q27,'Country codes'!$A$1:$E$247,4,FALSE),\"\")","v":""},{"$f":"IF($F27,VLOOKUP($Q27,'Country codes'!$A$1:$E$247,5,FALSE),\"\")","v":""},"","",0,0,"","Docs"]
[0,{"$f":"IF($F28,VLOOKUP($Q28,'Country codes'!$A$1:$E$247,4,FALSE),\"\")","v":""},{"$f":"IF($F28,VLOOKUP($Q28,'Country codes'!$A$1:$E$247,5,FALSE),\"\")","v":""},"","",0,0,"","Docs"]
[0,{"$f":"IF($F29,VLOOKUP($Q29,'Country codes'!$A$1:$E$247,4,FALSE),\"\")","v":""},{"$f":"IF($F29,VLOOKUP($Q29,'Country codes'!$A$1:$E$247,5,FALSE),\"\")","v":""},"","",0,0,"","Docs"]
[0,{"$f":"IF($F30,VLOOKUP($Q30,'Country codes'!$A$1:$E$247,4,FALSE),\"\")","v":""},{"$f":"IF($F30,VLOOKUP($Q30,'Country codes'!$A$1:$E$247,5,FALSE),\"\")","v":""},"","",0,0,"","Docs"]
[0,{"$f":"IF($F31,VLOOKUP($Q31,'Country codes'!$A$1:$E$247,4,FALSE),\"\")","v":""},{"$f":"IF($F31,VLOOKUP($Q31,'Country codes'!$A$1:$E$247,5,FALSE),\"\")","v":""},"","",0,0,"","Docs"]
[0,{"$f":"IF($F32,VLOOKUP($Q32,'Country codes'!$A$1:$E$247,4,FALSE),\"\")","v":""},{"$f":"IF($F32,VLOOKUP($Q32,'Country codes'!$A$1:$E$247,5,FALSE),\"\")","v":""},"","",0,0,"","Docs"]
[0,{"$f":"IF($F33,VLOOKUP($Q33,'Country codes'!$A$1:$E$247,4,FALSE),\"\")","v":""},{"$f":"IF($F33,VLOOKUP($Q33,'Country codes'!$A$1:$E$247,5,FALSE),\"\")","v":""},"","",0,0,"","Docs"]
[0,{"$f":"IF($F34,VLOOKUP($Q34,'Country codes'!$A$1:$E$247,4,FALSE),\"\")","v":""},{"$f":"IF($F34,VLOOKUP($Q34,'Country codes'!$A$1:$E$247,5,FALSE),\"\")","v":""},"","",0,0,"","Docs"]
[0,{"$f":"IF($F35,VLOOKUP($Q35,'Country codes'!$A$1:$E$247,4,FALSE),\"\")","v":""},{"$f":"IF($F35,VLOOKUP($Q35,'Country codes'!$A$1:$E$247,5,FALSE),\"\")","v":""},"","",0,0,"","Docs"]
[0,{"$f":"IF($F36,VLOOKUP($Q36,'Country codes'!$A$1:$E$247,4,FALSE),\"\")","v":""},{"$f":"IF($F36,VLOOKUP($Q36,'Country codes'!$A$1:$E$247,5,FALSE),\"\")","v":""},"","",0,0,"","Docs"]
[0,{"$f":"IF($F37,VLOOKUP($Q37,'Country codes'!$A$1:$E$247,4,FALSE),\"\")","v":""},{"$f":"IF($F37,VLOOKUP($Q37,'Country codes'!$A$1:$E$247,5,FALSE),\"\")","v":""},"","",0,0,"","Docs"]
[0,{"$f":"IF($F38,VLOOKUP($Q38,'Country codes'!$A$1:$E$247,4,FALSE),\"\")","v":""},{"$f":"IF($F38,VLOOKUP($Q38,'Country codes'!$A$1:$E$247,5,FALSE),\"\")","v":""},"","",0,0,"","Docs"]
[0,{"$f":"IF($F39,VLOOKUP($Q39,'Country codes'!$A$1:$E$247,4,FALSE),\"\")","v":""},{"$f":"IF($F39,VLOOKUP($Q39,'Country codes'!$A$1:$E$247,5,FALSE),\"\")","v":""},"","",0,0,"","Docs"]
[0,{"$f":"IF($F40,VLOOKUP($Q40,'Country codes'!$A$1:$E$247,4,FALSE),\"\")","v":""},{"$f":"IF($F40,VLOOKUP($Q40,'Country codes'!$A$1:$E$247,5,FALSE),\"\")","v":""},"","",0,0,"","Docs"]
[0,{"$f":"IF($F41,VLOOKUP($Q41,'Country codes'!$A$1:$E$247,4,FALSE),\"\")","v":""},{"$f":"IF($F41,VLOOKUP($Q41,'Country codes'!$A$1:$E$247,5,FALSE),\"\")","v":""},"","",0,0,"","Docs"]
[0,{"$f":"IF($F42,VLOOKUP($Q42,'Country codes'!$A$1:$E$247,4,FALSE),\"\")","v":""},{"$f":"IF($F42,VLOOKUP($Q42,'Country codes'!$A$1:$E$247,5,FALSE),\"\")","v":""},"","",0,0,"","Docs"]
[0,{"$f":"IF($F43,VLOOKUP($Q43,'Country codes'!$A$1:$E$247,4,FALSE),\"\")","v":""},{"$f":"IF($F43,VLOOKUP($Q43,'Country codes'!$A$1:$E$247,5,FALSE),\"\")","v":""},"","",0,0,"","Docs"]
[0,{"$f":"IF($F44,VLOOKUP($Q44,'Country codes'!$A$1:$E$247,4,FALSE),\"\")","v":""},{"$f":"IF($F44,VLOOKUP($Q44,'Country codes'!$A$1:$E$247,5,FALSE),\"\")","v":""},"","",0,0,"","Docs"]
[0,{"$f":"IF($F45,VLOOKUP($Q45,'Country codes'!$A$1:$E$247,4,FALSE),\"\")","v":""},{"$f":"IF($F45,VLOOKUP($Q45,'Country codes'!$A$1:$E$247,5,FALSE),\"\")","v":""},"","",0,0,"","Docs"]
[0,{"$f":"IF($F46,VLOOKUP($Q46,'Country codes'!$A$1:$E$247,4,FALSE),\"\")","v":""},{"$f":"IF($F46,VLOOKUP($Q46,'Country codes'!$A$1:$E$247,5,FALSE),\"\")","v":""},"","",0,0,"","Docs"]
[0,{"$f":"IF($F47,VLOOKUP($Q47,'Country codes'!$A$1:$E$247,4,FALSE),\"\")","v":""},{"$f":"IF($F47,VLOOKUP($Q47,'Country codes'!$A$1:$E$247,5,FALSE),\"\")","v":""},"","",0,0,"","Docs"]
[0,{"$f":"IF($F48,VLOOKUP($Q48,'Country codes'!$A$1:$E$247,4,FALSE),\"\")","v":""},{"$f":"IF($F48,VLOOKUP($Q48,'Country codes'!$A$1:$E$247,5,FALSE),\"\")","v":""},"","",0,0,"","Docs"]
[0,{"$f":"IF($F49,VLOOKUP($Q49,'Country codes'!$A$1:$E$247,4,FALSE),\"\")","v":""},{"$f":"IF($F49,VLOOKUP($Q49,'Country codes'!$A$1:$E$247,5,FALSE),\"\")","v":""},"","",0,0,"","Docs"]
[0,{"$f":"IF($F50,VLOOKUP($Q50,'Country codes'!$A$1:$E$247,4,FALSE),\"\")","v":""},{"$f":"IF($F50,VLOOKUP($Q50,'Country codes'!$A$1:$E$247,5,FALSE),\"\")","v":""},"","",0,0,"","Docs"]
[0,{"$f":"IF($F51,VLOOKUP($Q51,'Country codes'!$A$1:$E$247,4,FALSE),\"\")","v":""},{"$f":"IF($F51,VLOOKUP($Q51,'Country codes'!$A$1:$E$247,5,FALSE),\"\")","v":""},"","",0,0,"","Docs"]
[0,{"$f":"IF($F52,VLOOKUP($Q52,'Country codes'!$A$1:$E$247,4,FALSE),\"\")","v":""},{"$f":"IF($F52,VLOOKUP($Q52,'Country codes'!$A$1:$E$247,5,FALSE),\"\")","v":""},"","",0,0,"","Docs"]
[0,{"$f":"IF($F53,VLOOKUP($Q53,'Country codes'!$A$1:$E$247,4,FALSE),\"\")","v":""},{"$f":"IF($F53,VLOOKUP($Q53,'Country codes'!$A$1:$E$247,5,FALSE),\"\")","v":""},"","",0,0,"","Docs"]
[0,{"$f":"IF($F54,VLOOKUP($Q54,'Country codes'!$A$1:$E$247,4,FALSE),\"\")","v":""},{"$f":"IF($F54,VLOOKUP($Q54,'Country codes'!$A$1:$E$247,5,FALSE),\"\")","v":""},"","",0,0,"","Docs"]
[0,{"$f":"IF($F55,VLOOKUP($Q55,'Country codes'!$A$1:$E$247,4,FALSE),\"\")","v":""},{"$f":"IF($F55,VLOOKUP($Q55,'Country codes'!$A$1:$E$247,5,FALSE),\"\")","v":""},"","",0,0,"","Docs"]
[0,{"$f":"IF($F56,VLOOKUP($Q56,'Country codes'!$A$1:$E$247,4,FALSE),\"\")","v":""},{"$f":"IF($F56,VLOOKUP($Q56,'Country codes'!$A$1:$E$247,5,FALSE),\"\")","v":""},"","",0,0,"","Docs"]
[0,{"$f":"IF($F57,VLOOKUP($Q57,'Country codes'!$A$1:$E$247,4,FALSE),\"\")","v":""},{"$f":"IF($F57,VLOOKUP($Q57,'Country codes'!$A$1:$E$247,5,FALSE),\"\")","v":""},"","",0,0,"","Docs"]
[0,{"$f":"IF($F58,VLOOKUP($Q58,'Country codes'!$A$1:$E$247,4,FALSE),\"\")","v":""},{"$f":"IF($F58,VLOOKUP($Q58,'Country codes'!$A$1:$E$247,5,FALSE),\"\")","v":""},"","",0,0,"","Docs"]
[0,{"$f":"IF($F59,VLOOKUP($Q59,'Country codes'!$A$1:$E$247,4,FALSE),\"\")","v":""},{"$f":"IF($F59,VLOOKUP($Q59,'Country codes'!$A$1:$E$247,5,FALSE),\"\")","v":""},"","",0,0,"","Docs"]
[0,{"$f":"IF($F60,VLOOKUP($Q60,'Country codes'!$A$1:$E$247,4,FALSE),\"\")","v":""},{"$f":"IF($F60,VLOOKUP($Q60,'Country codes'!$A$1:$E$247,5,FALSE),\"\")","v":""},"","",0,0,"","Docs"]
{"$rows_left_out":339}
{"sheet":"Country codes","index":3,"n_rows":254,"n_cols":5,"rows_kept":254}
["Country (ARH3)","ISO2","Land","Region","Sub-region"]
["Aaland islands","ax","Ålandsøerne","Europe","Northern Europe"]
["Afghanistan","af","Afghanistan","Asia","South-central Asia"]
["Albania","al","Albanien","Europe","Southern Europe"]
["Algeria","dz","Algeriet","Africa","Northern Africa"]
["American Samoa","as","Samoa, Amerikansk Samoa","Oceania","Polynesia"]
["Andorra","ad","Andorra","Europe","Southern Europe"]
["Angola","ao","Angola","Africa","Middle Africa"]
["Anguilla","ai","Anguilla","Latin America and the Caribbean","Caribbean"]
["Antarctica","aq","Antarktis","Antarctic","Antarctic"]
["Antigua and Barbuda","ag","Antigua og Barbuda","Latin America and the Caribbean","Caribbean"]
["Argentina","ar","Argentina","Latin America and the Caribbean","South America"]
["Armenia","am","Armenien","Asia","Western Asia"]
["Aruba","aw","Aruba","Latin America and the Caribbean","Caribbean"]
["Australia","au","Australien","Oceania","Australia and New Zealand"]
["Austria","at","Østrig","Europe","Western Europe"]
["Azerbaijan","az","Aserbajdsjan, Azerbajdjan","Asia","Western Asia"]
["Bahamas","bs","Bahamas","Latin America and the Caribbean","Caribbean"]
["Bahrain","bh","Bahrain","Asia","Western Asia"]
["Bangladesh","bd","Bangladesh","Asia","South-central Asia"]
["Barbados","bb","Barbados","Latin America and the Caribbean","Caribbean"]
["Belarus","by","Belarus (Hviderusland)","Europe","Eastern Europe"]
["Belgium","be","Belgien","Europe","Western Europe"]
["Belize","bz","Belize","Latin America and the Caribbean","Central America"]
["Benin","bj","Benin","Africa","Western Africa"]
["Bermuda","bm","Bermuda","Northern America","Northern America"]
["Bhutan","bt","Bhutan","Asia","South-central Asia"]
["Bolivia","bo","Bolivia","Latin America and the Caribbean","South America"]
["Bonaire, Sint Eustatius and Saba","bq","Bonaire, Sint Eustatius og Saba","Latin America and the Caribbean","Caribbean"]
["Bosnia and Herzegovina","ba","Bosnien-Herzegovina","Europe","Southern Europe"]
["Botswana","bw","Botswana","Africa","Southern Africa"]
["Bouvet Island","bv","Bouvet øen","Antarctic","Antarctic"]
["Brazil","br","Brasilien","Latin America and the Caribbean","South America"]
["British Virgin Islands","io","Jomfruøerne","Africa","Eastern Africa"]
["Brunei","bn","Brunei","Asia","South-eastern Asia"]
["Bulgaria","bg","Bulgarien","Europe","Eastern Europe"]
["Burkina Faso","bf","Burkina Faso","Africa","Western Africa"]
["Burundi","bi","Burundi","Africa","Eastern Africa"]
["Cambodia","kh","Cambodja","Asia","South-eastern Asia"]
["Cameroon","cm","Cameroun","Africa","Middle Africa"]
["Canada","ca","Canada","Northern America","Northern America"]
["Cape Verde","cv","Kap Verde","Africa","Western Africa"]
["Cayman Islands","ky","Caymanøerne","Latin America and the Caribbean","Caribbean"]
["Central African Republic","cf","Den Centralafrikanske Republik","Africa","Middle Africa"]
["Chad","td","Tchad","Africa","Middle Africa"]
["Chile","cl","Chile","Latin America and the Caribbean","South America"]
["China","cn","Kina","Asia","Eastern Asia"]
["Christmas Island","cx","Juleøen","Asia","South-eastern Asia"]
["Cocos (Keeling) Islands","cc","Cocosøerne","Asia","South-eastern Asia"]
["Colombia","co","Colombia","Latin America and the Caribbean","South America"]
["Comoros","km","Comorerne","Africa","Eastern Africa"]
["Congo, Democratic Republic of","cd","Congo, Den Demokratiske Republik (DR Congo)","Africa","Middle Africa"]
["Congo, Republic of","cg","Congo, Republikken (Congo Brazzaville)","Africa","Middle Africa"]
["Cook Islands","ck","Cookøerne","Oceania","Polynesia"]
["Costa Rica","cr","Costa Rica","Latin America and the Caribbean","Central America"]
["Cote d'Ivoire","ci","Elfenbenskysten","Africa","Western Africa"]
["Croatia","hr","Kroatien","Europe","Southern Europe"]
["Cuba","cu","Cuba","Latin America and the Caribbean","Caribbean"]
["Curaçao","cw","Curaçao","Latin America and the Caribbean","Caribbean"]
["Cyprus","cy","Cypern","Asia","Western Asia"]
{"$rows_left_out":195}
{"sheet":"Vejledning","index":4,"n_rows":88,"n_cols":13,"rows_kept":88}
[null,null,"Generering af rapport i PhD Planneren samt efterfølgende behandling i Excel",{"$nulls":9},"Kopi af Data-fanebladet til upload på hovedopslaget opslaget"]
[]
[null,"1.","I PhD Planneren",{"$nulls":8},"10.","I regnearket du lige har gemt i trin 9:"]
[null,null,"a: Tjek at alle program-opslag har status \"Awaits school assessment\"",{"$nulls":9},"a: Højreklik på fanebladet \"Data\" og vælg \"Move or Copy...\""]
[null,null,"b: Vælg \"Kampagnestyring\"  » \"Rapporter og diagrammer\"",{"$nulls":9},"b: Vælg To book: \"(new book)\""]
[null,null,"c: Kør rapporten \"PHD Application and Programme Data\" i mappen \"PHD\"",{"$nulls":9},"c: Sæt kryds i \"Create a copy\""]
[null,null,"d: Åbn regnearket",{"$nulls":9},"d: Tryk \"OK\""]
[]
[null,"2.","Åbn \"Template for Application and Programme Data\"",{"$nulls":8},"11.","Gem det nye regneark"]
[]
[null,"3.","I regnearket fra PhD Planneren:",{"$nulls":8},"12.","I det nye regneark:"]
[null,null,"a: Højreklik på fanebladet og vælg \"Move or Copy...\"",{"$nulls":9},"a: Udpeg hele søjle H: Age (markér hele søjlen)"]
[null,null,"b: Vælg To book: \"Template for Application and Programme Data\"",{"$nulls":9},"b: Kopier den - tryk <ctrl> + c"]
[null,null,"c: Vælg Before sheet: \"Country codes\"",{"$nulls":9},"c: Højreklik og vælg \"Paste Special…\" » \"Values (V)\""]
[null,null,"d: Tryk \"OK\"",{"$nulls":9},"    ELLER"]
[null,null,"NB: Hvis du ikke kan se sheetet \"Country codes\", så er det sandsynligvis, fordi \"Template for ",{"$nulls":9},"    Klik på \"Paste\"-knappen på Home-faneb øverst og vælg \"Values (V)."]
[null,null,"Application and Programme Data\" er skrivebeskyttet. Gem \"Template for Application and Programme ",{"$nulls":9},"    (ligesom i punkt 6)"]
[null,null,"Data\" og prøv igen.",{"$nulls":9},"d: Tryk \"OK\""]
[]
[null,null,"Fanebladet i regnearket fra PhD Planneren flyttes nu ind i  \"Template for Application and",{"$nulls":8},"13.","Slet søjle A-G. Dvs. til, men ikke med Age-kolonnen."]
[null,null,"Programme Data\" (eller hvad du har valgt at kalde regnearket), og der arbejdes videre i ",{"$nulls":9},"Age er nu blevet til søjle A."]
[null,null,"\"Template for Application and Programme Data\"."]
[{"$nulls":11},"14.","Hvis ikke der allerede er filtre på kolonnerne, gør således for at aktivere filtrene:"]
[{"$nulls":12},"Marker celle A1 (Age-cellen):"]
[null,"4.","På fanebladet \"Report-x\" i dette regneark vælges alle celler fra og med dem i dem i den første blå",{"$nulls":9},"a: Klik på celle A1 for at markere den"]
[null,null," række til, men ikke med, cellerne i den sidste blå række.",{"$nulls":9},"b: Klik på Data-fanen foroven og klik på \"Filter\"-knappen"]
[null,null,"Brug musen til at udpege området. Eller brug tastaturet således:"]
[null,null,"a: Udpeg den blå celle \"Company name\" (A5)"]
[null,null,"b: Hold <ctrl>+<Skift> nede og tryk højre pil"]
[null,null,"c: Behold <ctrl>+<Skift> nede og tryk pil ned"]
[null,null,"d: Behold <skift> nede, slip <ctrl> og tryk pil op"]
[]
[null,"5.","Kopier det markerede område - tryk <ctrl> + c"]
[{"$nulls":12},"Der kommer nu pile ved siden af overskrifterne i række 1. Pilene indikerer at man kan  "]
[null,"6.","Dataene fra fanebladet \"Report-x\" skal nu indsættes på fanebladet \"Data\".",{"$nulls":9},"sortere værdierne i kolonnerne."]
[null,null,"a: Klik på fanebladet \"Data\" på den grønne celle \"Company name\""]
[null,null,"b: Højreklik og vælg \"Paste Special…\" » \"Values (V)\"",{"$nulls":8},"15.","Hvis ikke den øverst række allerede er fastlås, gør således for at fastlåse den:"]
[null,null,"    ELLER",{"$nulls":9},"a: Klik på View-fanen øverst, klik på \"Freeze Panes\" » \"Freeze Top Row\" "]
[null,null,"    Klik på \"Paste\"-knappen på Home-faneb øverst og vælg \"Values (V)."]
{"$rows_empty":13}
[{"$nulls":12},"Den øverste række kan nu ses, ligegyldigt hvor langt der scrolles ned."]
[]
[{"$nulls":11},"16.","Slet evt. søjler, der ikke skal bruges."]
[{"$nulls":12},"MEN slet under ingen omstændigheder søjlerne Docs og UpdateCode!!!"]
[{"$nulls":12},"Hvis de slettes, kan man ikke klikke på Docs og se vedhæftninger."]
[]
[{"$nulls":11},"17.","Gem regnearket"]
[{"$nulls":12},"Sorter evt. på \"Academic assessment\" og fjern de rækker med ansøgere, der ikke er \"Qualified\"."]
[{"$nulls":12},"Evt. kan man lave en kopi af regnearket, hvor man kun beholder ansøgere,  der er \"Not qualified\""]
[]
[null,"7.","Tjek at kolonnerne A-I er fyldt ud for alle ansøgere. Hvis ikke, så markér den nederste"]
[null,null,"udfyldte række. Placér musen nederst til højre i markeringen. Der kommer et lille plus frem."]
[null,null,"Dobbeltklik mens plusset er fremme."]
{"$rows_empty":9}
[null,"8.","Klik på Data-fanen øverst, og tryk \"Refresh All\"."]
{"$rows_empty":8}
[null,"9.","Tjek at tabellerne på de første to faneblade (Application statistics og Gender statistics)"]
[null,null,"er blevet opdateret."]
[]
[null,"10.","Gem regnearket (dette regneark skal nu bruges som grundlag for at lave et nyt regneark,"]
{"$rows_left_out":1}